Finished with non zero exit value 127


48 in, Padfoot, Single-Drum, Ride-On Roller

After that when I tried to run that on Android I am getting the below error, FAILURE: Build failed with an exception. If the script that the user defines inside of . 2078. Fix bugs for1-Android finished with non zero exit value2-Cannot load Android Layout Android初学者Process 'command '*****'' finished with non-zero exit value 1错误解决方案 这个问题仅限于一些Android初学者在页面布局里遇到的问题 我也是刚刚开始写不久,如有总结不到位的请及时联系我: panchui3301po@163. 127. exe finished with non-zero exit value 1 Posted by: admin November 25, 2017 Leave a comment [My Android Advanced Tour] Solve the problem of error=2 and finished with non-zero exit value 127 when compiling Android APP on Center OS 64-bit system, Programmer Sought, the best programmer technical posts sharing site. 0_161\bin\java. I want to see "ArithmeticException" and in what line it did occur. Hot Network Questions What does, "‘Much of that!’ said he, glancing about him over the cold wet flat. Consider following shell script: 43. A non-zero (1-255 values) exit status means command was failure. 2\aapt. exe'' finished with non-zero exit value; Finished with Non Zero Exit Value 3; finished with non-zero exit value 1 in new project; Instant Apps - Error:org. Nov 20, 2020 As far as I know, there are only two, more-or-less, standard values -- both defined in stdlib. e. 1 library to make it work, on Ubuntu 15. Enter git config user. Closed. but when I run the application I am getting the following error: Error: Execution failed for task ':app:processDebugResources'. I really like the azure mobile service and notification hub. You can store result of exit status in variable. For the bash shell’s purposes, a command which exits with a zero (0) exit status has succeeded. For example, GNU grep returns 0 on success, 1 if no matches were found, and 2 for other errors (syntax errors, non-existent input files, etc). FAILURE: Build failed with an exception. 从shell命令中退出代码127意味着“没有找到命令”。. sel Finished with non-zero exit value 1 Updated on March 30, 2021 Streamit - Flutter Video Streaming Full App For Wordpress how to fix finished with non-zero exit value 2. buildevents. api. Android初学者Process 'command '*****'' finished with non-zero exit value 1错误解决方案 这个问题仅限于一些Android初学者在页面布局里遇到的问题 我也是刚刚开始写不久,如有总结不到位的请及时联系我: panchui3301po@163. internal. Finished with non-zero exit value 1 In case, you are getting this error, there could multiple reasons for this. tsv simon1 (arriolasimon@gmail. 2 Android SDK build-tools 23. navigate to the Project tab. Android Studio Failing to Run Tutorial App. RobbySmet opened this A simple "print ('e')" does not print anything and gives "Process finished with exit code 1" It wasn't like this before, I think windows update Home » Android » Android java. cmd'' finished with non-zero exit value 2. sh: line 3: non-existing-command: command not found 127. navigate to the Build, Execution, Development > Build Tools > Gradle I use an array to capture the process id of those background processes. Hello community, Since a week I can’t deploy new version of our app. 因此,在您的例子中,当Docker运行时,似乎没有找到引号中的“wget”。. ProcessException: org. 1. In my case, I had to install libz. ketika saya akan membangun aplikasi dari Android studio maka saya mendapatkan kesalahan di bawah ini, Proses 'perintah 'sh'' selesai dengan nilai keluar bukan nol 255 The HANDLED local variable is automatically defined with the initial value being the empty string. The exit status is an integer number. 图片,drawable中的图片名字不对,或者引用错误 2. 0 failed 4 times, most recent failure: Lost task 2. Thread starter Michael Hart; Start date Jun 25, 2016; Tags compile sdk; Michael Hart Member. ‘I wish I was $ . Caused by: org. 8. > Process 'command 'python'' finished with non-zero exit value 1 06-16 00:16:54. gradle. > finished with non-zero exit value 1 build. What went wrong: Execution failed for task ':app:buildJni'. sh . A non-zero (1-255) exit status indicates failure. Execution failed for task ':processReleaseResources'. exe finished with non-zero exit value 1 Android java. sel Questions: I am trying to import my project. Consider following shell script: up vote 11 down vote favorite 1 The Draconic Bloodline sorcerer's 6th-level feature, Elemental Affinity, lets you add your Charisma modifier to the damage when you cast a spell. exe'' finished with non-zero exit value 1, Programmer Sought, the best programmer technical posts sharing site. Process command finished with non-zero exit value 1. 直接上图 这个错误我很快就找到了,哪里出了错,但是感觉这个错误还是比较有趣的的,所以贴出来共享一下把 Join the Discussion. 0_25\bin\java. 错误 finished with non-zero exit value 1. ExecException: Process 'command' finished with non-zero exit value 1; Error: finished with non-zero exit Gradle exception: finished with non-zero exit value 1, Process 'command 'C:\Program Files\Java\jdk1. If you're still seeing the first failure message, then you're not using the new nightly build for some reason, because that code is gone. libp2p. 1:27017. Halo. Run with --info or --debug option to get more log output. sel * What went wrong: Execution failed for task ':test'. If the command times out, a warning is issued and the exit status is 124. Random. 1258 (0x4EA) The security identifier provided does not have a domain component. Still have any questions about an article, leave us a comment. /bash-127. Created July 18, 2021 12:03. example in Pinger. After finish processing, hit second command flutter pub get. 3. TaskExecutionLogger] > Task :server:sonar-docs:nodeSetup 10 For a long time, I don't want to talk now, why is this problem happening, Process 'command 'D:\jdk8\jdk\bin\java. What went wrong: Execution failed for task ':create'. I've tried the extra empty c file. The command “yarn build” fail each time without so much information. gradle 运行wordcount时,报错Container exited with a non-zero exit code 127 解决Android编译时出现aapt. I made a ArithmeticException on purpose by divide 3 by zero. Asking for help, clarification, or responding to other answers. * Where: Script 'C:\src\flutter\packages\flutter_tools\gradle\flutter. jdks\azul-15. The docker container is limit to 4 GB. The package should be io. 04 with this command: sudo apt-get install lib32z1 Later, I make a deep survey and found to support 32bit Android platform in ubuntu 64 os, one should install the 32bit library. 3\bin\java. There are two possible meanings: · The job exits with exit code 127. exe finished with non-zero exit value 2" Faça uma pergunta Perguntada 5 anos, 5 meses atrás. exe'' finished with non- zero exit Java Process finished with non-zero exit value -1073741819 I'm getting the following error: from Recent Questions - Stack Overflow https://ift. yml file exits with a non-zero code, run_exec should exit with BUILD_FAILURE_EXIT_CODE value. 16. note We strongly suggest using BUILD_FAILURE_EXIT_CODE to exit instead of a hard coded value since it can change in any release, making your binary/script future proof. However, it is failing to start, with exit code 127. exe finished with non-zero exit value 1. [My Android Advanced Tour] Solve the problem of error=2 and finished with non-zero exit value 127 when compiling Android APP on Center OS 64-bit system, Programmer Sought, the best programmer technical posts sharing site. This value can indicate different reasons for failure. Provide details and share your research! But avoid …. 2. 0_40\bin\java. 3k 6 6 gold badges 85 85 silver badges 127 127 bronze Check the value of $?, some commands don't return a non-zero exit status if command failed or couldn Android java. Skip to first unread message Hello community, Since a week I can’t deploy new version of our app. ExecException: Process 'command 'D:\MYDATA\android-ndk-r10d dk-build. 393768483s but also show a massive code block that doesn’t tell me anything. , having the same meaning for all programs in the world, is 0 (zero) which stands for SUCCESS. > Process 'command 'tar'' finished with non-zero exit value 128 * Try: Run with --stacktrace option to get the stack trace. Go to IntelliJ IDEA > Preference. com 一、 布局: 1. We've seen that a clean re-install of the Agent will fix most issues. versions used SonarQube 7. so. 9 error observed 10:33:59. 只需要修改成统一的版本的就可以了. You can also specify an exit code in order to indicate to other programs that or how your script failed, e. (By convention, exit code 0 is for success and anything greater than 0 signifies failure; however, also by convention, exit codes above 127 are reserved for abnormal termination (e. > Process 'command 'C:\src\flutter\bin\flutter. 7 release ready! If our Build Jobs run inside a Docker container then we receive continue the error: Process ‘Gradle Test Executor 8’ finished with non-zero exit value 137 It sound like that Gradle consume to many memory through pooling of JVM’s. If a command is not found, the child process created to execute it returns a status of 127. 1257 (0x4E9) The security identifier provided is not from an account domain. 5. Joined: Feb 17, 2018 Posts: 2. gradle' line: 882 * What went wrong: Execution failed for task ':app:compileFlutterBuildDebug'. 03-08. SparkException: Job aborted due to stage failure: Task 2 in stage 3. process. When I execute the java file in terminal, It shows me what I want What Actually Happened. bat'' finished with non-zero exit value 1 * Try: Run with --stacktrace option to get the 10:50:27. com) January 9, 2021, 7:41pm #4 Thanks for contributing an answer to Stack Overflow! Please be sure to answer the question. · If LSF returns 127, it means a command in the job is not found or executable. 4 Here the build log Process 'command 'C:\Program Files\Java\jdk1. Otherwise if wait = TRUE the value is the exit status returned by the command, and if wait = FALSE it is 0 (the conventional success value). 152:44008 1202 main INFO: S3 subsystem successfully initialized 9. 3 in stage 3. sudo apt-get install lib32z1 lib32ncurses5 lib32stdc++6 here is my environment: Ubuntu 14. Execution failed for task ':app:dexDebug'. ERROR_APPHELP_BLOCK. exe' finished with non-zero exit value 2 android project: process finished with non-zero exit value 2 A non-zero exit status indicates failure. The exit status of the simple command is that of the command string . exit 1 or exit 2 etc. sel Big thanks to Webkul and his team for helping get Opencart 3. The Gradle options limits the Java memory to 1 GB. 4:48:39 PM: failed during stage ‘building site’: Build script returned non-zero exit code: 1 4:48:39 PM: Finished processing build request in 3m1. common. Purge and Re-Install the Linux Agent. Support. I am getting sporadic results where some of the background processes return an exit code of 127. > Process 'Gradle Test Executor 6' finished with non-zero exit value 137 * Try: Run with --debug option to get more log output. 410. Enter flutter clean command in terminal. 1" 版本和主版本不一致导致的. Process 'command' finished with non-zero exit value; zipalign. internal, executor 4): ExecutorLostFailure (executor 4 exited caused by one of the running tasks) Reason: Container marked as failed: container_1516900607498_6585_01_000008 on host: ip-xxx-xxx-xx-xxx hi @Richard934 - we always recommend using the search to see if there are other people who already had this problem! in this case there are a bunch of questions: The directory structure io/libp2p/example/ping does not match the declared package io. gradle file contains the code apply plugin : ‘application’ // In this section you declare where to find the dependencies of your project repositories { // Use jcenter for resolving your dependencies. Error:Execution failed for task ':app:preDexDebug'. Run with --scan to get full insights. BuildExceptionReporter] Cause: Gradle Worker 1 finished with (non-zero) exit value 1. Process 'command 'F:\sdk\build-tools\26. ; If 1. If the HANDLED variable has a non-empty value when the execution of the command string is finished, the shell pretends that the command was successfully determined and executed. > finished with non-zero exit value 1 * Try: Run with --stacktrace option to get the stack trace. tasks. exe'' finished with non-zero exit valu,代码先锋网,一个为软件开发程序员提供代码片段和技术文章聚合的网站。 Android初学者Process 'command '*****'' finished with non-zero exit value 1错误解决方案 这个问题仅限于一些Android初学者在页面布局里遇到的问题 我也是刚刚开始写不久,如有总结不到位的请及时联系我: panchui3301po@163. Clean & Re-build project. 04 x86_64 Android Studio 2. 3 here is my question: Gradle build failed and says that aapt finished with non zero exit value 127 H Hello, Trying to run this demo on android I have compiled TVM4J and installed that in local maven repo. A pleasure to read the documentation and implement, but this was one of the gotchas. aapt finished with non zero exit value 127. example. I've previously run apps without a problem but my new app suddenly started giving me problems. 43. 1260 Android: app:transformClassesWithDexForDebug…ExecException: Process ‘command ‘C:\Program Files\Java\jdk1. 1259 (0x4EB) AppHelp dialog canceled thus preventing the application from starting. Is there any way to fix this? This is the journal. /il2cpp. At first, I thought it was a JDK problem. I have started encountering the following Gradle Test Executor X finished with non-zero exit value 143. 537 [ERROR] [org. We are using Gradle to build and run tests in Jenkins for CI. This seemingly counter-intuitive scheme is used so there is one well-defined way to indicate success and a variety of ways to indicate various failure modes. In some cases, the Finished with non-zero exit value 1. ERROR_ACCESS_DISABLED_BY_POLICY. ERROR_NON_DOMAIN_SID. Often, higher values for the exit code indicate more severe types of failure. 0 exit status means the command was successful without any errors. In case, you are getting this error, there could multiple reasons for this. Import_cv2. Jun 25, 2016 #1 finished with non-zero exit value -1073741819 finished with non-zero exit value -1 (2,3) androidstudio报错 都是例如: buildToolsVersion = "22. > com. Exit code 127 from shell commands means "command not found". Go to File> Project Structure. * Exception is: org. Ex. mortoza_khan (Mortoza Khan) February 10, 2018, 5:42pm #1. 1 seconds. compute. jdk1. Can you see something I may made wrong ? Thanks a lot ! Here my variables : Key CYPRESS_RECORD_KEY Value ea2ec1ea-edbe-40f0-9300-72 DEBUG netlify-plugin-cypress,netlify-plugin-cypress:verbose NODE_VERSION 12. exe’’ finished with non-zero exit value 1 build. TaskExecutionException: Execution failed for task ':test'. I then loop through the array and issue a 'wait' command to wait on the process id that was captured in the array. 0). Open the terminal in Android studio. I tried to start making my own Minecraft Mod but if i want to start it it says this: Execution failed for task ':runClient'. If you liked this article, then please share it on social media. by a signal)). This should be enough. 17. but when I run the file on intellij, It just shows "non-zero exit code" Process ‘command ‘C:\Program Files\Java\jre1. Looking up the information on the Internet, we found that it might be a git problem. android. but when I run the file on intellij, It just shows "non-zero exit code" Android finished with non-zero exit value 1. Gradle exception: finished with non-zero exit value 1. sudo journalctl --follow -u serviceName -- Logs begin at Tue 2017-08-08 16:27:10 GMT. When a command terminates on a fatal signal whose number is N, Bash uses the value 128+N as the exit status. exe’ finished with non-zero exit value 126 while creating a build in android studio for unity game May 21, 2021 android , unity3d I have imported the unitylibrary into android studio and I have downloaded the ndk version 19. gitlab-ci. com) January 9, 2021, 7:41pm #4 Exit Status. 5345600 when i try to run my project i get this issues Erro no gradle build: "java. java. FFrench. The Linux man pages stats the exit statuses of each command. 1329 views. This could be due to some error in the code which is preventing it from building. Process 'command 'mongo'' finished with non-zero exit value 1. > Solution2. tt/317jjxh Finished with non-zero exit value 1 In case, you are getting this error, there could multiple reasons for this. Process command ‘. 三石的专栏. 3k 6 6 gold badges 85 85 silver badges 127 127 bronze Check the value of $?, some commands don't return a non-zero exit status if command failed or couldn Success is traditionally represented with exit 0; failure is normally indicated with a non-zero exit-code. exe’… finished with non-zero exit I made a ArithmeticException on purpose by divide 3 by zero. ide. "exit 127" or "return (127)”. ping (or the ping directory removed). Help Wanted process command finished with non-zero exit value 4. If a command is found but is not executable, the return status is 126. exe'' finished with non-zero exit value 1. 7. 218 [LIFECYCLE] [class org. Answer (1 of 2): A non zero exit value denotes an error during the process. ERROR_NON_ACCOUNT_SID. 22. So, in your case it seems the "wget" within quotes is not being found when Docker runs it. exe finished with non-zero exit value 2 Grunt build inside Docker Container returned a Non-zero code: 6 Using God to monitor Unicorn - Start exited with non-zero In the example below you can see that although the connection and file transfer finishes successfully, the attempt to set script option confirm to yes (instead of valid on) is the reason, why script exits with code 1 nevertheless. 0_79\bin\java. apache. Answered. 8 is an option, choose 1. exe'' finished with non-zero exit value 2. That's because there are conflicting dependencies in the project, take a closer look at whether you have duplicate dependencies. A non-zero exit status indicates failure. Later, I changed the JDK version and did not fix it. Android Studio Warning: Process ‘command ‘git‘‘ finished with non-zero exit value 1. Exception is: After execution we can see the the actual error message and bash 127 error return code: $ . h for use with exit(): EXIT_SUCCESS (=0) EXIT_FAILURE (=1) And the only de-facto standard value, i. sh: line 3: non-existing-command: command not found 127 Value 127 is returned by your shell /bin/bash when any given command within your bash script or on bash command line is not found in any of the paths defined by PATH system environment variable. Set Gradle Project. . exe'' finished with non-zero exit value 1 #46. Just If the command could not be run for any reason, the value is 127 and a warning is issued (as from R 3. 0. Try: Run with --info or --debug option to get more log output. 0_144\bin\java. 0 (TID 23, ip-xxx-xxx-xx-xxx. others-how to solve finished with non-zero exit value 143 when using gradle bootRun in SpringBoot apps. Value 127 (non-zero) indicates command cyberciti failed to execute. g. 0_60\bin\java. Process 'command 'sh'' finished with non-zero exit value 127 Can anyone help me with this? connecting to: mongodb://127. 今天在写程序的时候发生一个错误,希望拿出来让大家看一看,以后不要犯这样的错误。. -- Aug 08 17:06:57 raspberrypi systemd[1]: Started serviceName. exception: connect failed:create FAILED. > Process 'Gradle Test Executor 79' finished with non-zero exit value 143 This problem might be caused by incorrect Estou tentando executar o compilador do Android Studio, porem me retorna este erro. Value 127 is returned by your shell /bin/bash when any given command within your bash script or on bash command line is not found in any of the paths defined by PATH system environment variable. In fact this may be the first suggestion from Support to get the Agent into a uncurropted state from our support team. > Process 'command 'C:\Users\Besitzer-R6569976\. ExecException: Process 'command 'C:\Users\Vishnu Ruhela\AppData\Local\Android\sdk\build-tools\21. Discussion in 'Android' started by FFrench, Sep 6, 2021. November 27, 2017, at 00:21 AM. spark. To solve this error, we have covered all the possible solutions here. On running with --stacktrace this is the result. Refer to "Understanding Platform LSF job exit information” in "Platform LSF Configuration Python - CalledProcessError: Command '[]' returned non-zero exit status 127 Android studio: Process 'command 'python'' finished with non-zero exit value 1 CalledProcessError: Command '('grep', 'route')' returned non-zero exit status 1 127. 4 Here the build log Android初学者Process 'command '*****'' finished with non-zero exit value 1错误解决方案 这个问题仅限于一些Android初学者在页面布局里遇到的问题 我也是刚刚开始写不久,如有总结不到位的请及时联系我: panchui3301po@163. I've tried looking at similar ones and no solution has worked. It always fails when I try to run it saying: Here is what the console displayed: The CPU time used is 0. py : return non-zero exit status 1 at each mp3 file of test. Every Linux command executed by the shell script or user, has an exit status. What I want to happen. > Failed to query the value of task ':runIde' property 'projectExecutable'. In many builds we see build failures with the following text: Execution failed for task ':myTests'. Process 'command 'C:\Program Files\Java\jdk1. Ativa 1 mês atrás. Thu Nov 18 18:39:28: Completed . finished with non zero exit value. 2 YARN_VERSION 1. You can use exit status in shell scripting too. There is a convention, however, that an exit code of zero means success (though what constitutes “success” is left to the discretion of the author of the program) and a nonzero exit code means failure (again, with details left to the discretion of the programmer). 127 172. When a command terminates on a fatal signal N , bash uses the value of 128+ N as the exit status. Stack Exchange network consists of 178 Q&A communities including Stack Overflow, the largest, most trusted online community for developers to learn, share their knowledge, and build their careers. com. New to all this so I don't really understand what is going on. I've added the NDK directory. exe finished with non-zero exit value 1 Android studio 编译时出现java.

×
Use Current Location